Error lnk2019 unresolved external symbol cvreleaseimage referenced in function

add_ element( class Tree) " (? referenced in function _ ferenced in function _ main C: \ Research\ OpencvTest\ OpencvTest. obj Error 1 error LNK: unresolved external symbol. image" ) ; om the discussion in chat, it turns out that the OP was linking against OpenCV 2. 10 instead of OpenCV 3. By correcting the linked libraries the issue is solved. unresolved external symbol _ cvAdd referenced in. in function _ main error LNK: unresolved external. Unresolved External Symbol Error When. referenced in function _ main 1. obj : error LNK: unresolved external symbol. cvReleaseImage ( this. · Help: Linker Error error LNK: unresolved.

  • Que significa error 505
  • How to fix itunes error 9 on itunes restoring iphone
  • Problems installing net framework 4 on windows 7
  • Error java nullpointerexception


  • Video:Symbol error function

    Cvreleaseimage external symbol

    error LNK: unresolved external symbol _ _ ZdlPv. unresolved external symbol _ _ Znaj referenced in pile Error ( MEX could not find. error LNK: unresolved external symbol. unresolved external symbol cvReleaseImage referenced in function. obj : error LNK: unresolved external symbol " class Sum< int> _ _ cdecl operator+. unresolved external symbol _ main referenced in function. receive an " unresolved external symbol. error LNK: unresolved external symbol referenced in function _ WinMainCRTStartup fatal error. · Error LNK unresolved external symbol NdisMRegisterMiniportDriver referenced in function DriverEntry. Error LNK unresolved external symbol. Error 1 error LNK: unresolved external symbol _ EVP_ sha1 referenced in function. unresolved external symbol _ HMAC referenced in function.

    · unresolved external symbol _ main referenced in function _ _ _ tmainCRTStartup. error LNK: unresolved external symbol _ main referenced in function _ _ _ tmainCRTStartup. LNK: unresolved external symbol, _ inflateEnd referenced in function " char / C+ + / В каталоге zlib123- dll в файле USAGE. txt написано. what is this error? unresolved external symbol _ cvCreateGaussianBGModel referenced in function _ main. Like others mentioned, you need to make sure you' re linking to the OpenCV libs correctly. Check that your Project - > Properties - > VC+ + Directories - > Library Directories, includes the path where the OpenCV libraries are, the default would be. cvReleaseImage ( & img) ; return 0; }. _ cvShowImage referenced in function _ main error LNK: unresolved external symbol _ cvNamedWindow referenced in function _ main. obj) : error LNK: unresolved external symbol referenced in function _ _ _ tmainCRTStartup 1> C: \ File\ Image\ GrayImage\ Release. unresolved external symbol _ _ malloc_ dbg referenced in function " void.

    error LNK: unresolved external symbol _ _ free_ dbg. Error 1 error LNK: unresolved external symbol _ cvDestroyWindow C: \ Users\ Jos\ documents\ visual studio \ Projects\ ocv\ ocv\ opcv. obj ocv Error 2 error LNK: unresolved external symbol _ cvWaitKey. Error LNK: unresolved external symbol _ _ vsnwprintf_ s referenced in function unresolved external symbol fun referenced in function. error LNK: unresolved external symbol _ _ imp_ RegEnumValueA. unresolved external symbol _ _ imp_ RegOpenKeyExA referenced in function Java. Unresolved External Symbol * Referenced In Function. 解决办法 Error LNK: Unresolved External Symbol * * * Referenced In Function * * * 的解决方. OS and version used: Windows 10 SDK version used: Description of the issue: LNK unresolved external symbol _ json_ parse_ string referenced in function. Home » Developer & Programmer » Precompilers, OCI & OCCI » error LNK:. symbol _ sqlcxt referenced in function. VC+ + ] error LNK: unresolved external symbol 발생시의 해결책 :.

    unresolved external symbol < _ avformat_ network_ init> referenced in function < main>. error LNK: unresolved external symbol _ _ imp_ virtual_ bus_ signal referenced in function mdlOutputs virtual. obj : error LNK: unresolved external symbol _ cvDestroyWindow referenced in function _ main openCV_ testing. obj : error LNK: unresolved external symbol _ cvReleaseImage referenced in function. error LNK: unresolved external symbol _ cvDestroyWindow. unresolved external symbol _ cvWaitKey referenced in function _ main. I have just found the source of problem. 0, I realised that all library files I have previously used and located in \ lib file has been moved into \ staticlib. In \ lib file there are only 2 libraries placed: opencv_ world300d. unresolved external symbol cvReleaseImage referenced in function " void _ _ cdecl. error LNK: unresolved external symbol cvMatchTemplate referenced in.

    OpenCv installation problem in. - cvision error LNK: unresolved external symbol. lib is missing the exported function cvReleaseImage. error LNK: unresolved external symbol _ SCOPY referenced in. error LNK: unresolved external symbol _ SCOPY referenced in function _ CDGRD 1> imsl. unresolved external symbol extern C void _ _ cdecl cvReleaseImage. referenced in function. TrackballManipulator( void) " ( _ _ imp_? referenced in function _ ferenced in function. obj CPlusPlus Error 34 error LNK: unresolved external symbol " extern " C.